﻿  Determining projects to restore...
  All projects are up-to-date for restore.
C:\Program Files\dotnet\sdk\10.0.100-preview.6.25358.103\Sdks\Microsoft.NET.Sdk\targets\Microsoft.NET.RuntimeIdentifierInference.targets(335,5): message NETSDK1057: You are using a preview version of .NET. See: https://aka.ms/dotnet-support-policy [E:\GIT\forkmessager\apps\server-net\src\Modules\Chats\Knot.Modules.Chats.csproj]
C:\Program Files\dotnet\sdk\10.0.100-preview.6.25358.103\Sdks\Microsoft.NET.Sdk\targets\Microsoft.NET.RuntimeIdentifierInference.targets(335,5): message NETSDK1057: You are using a preview version of .NET. See: https://aka.ms/dotnet-support-policy [E:\GIT\forkmessager\apps\server-net\src\Shared\Knot.Shared.Infrastructure\Knot.Shared.Infrastructure.csproj]
C:\Program Files\dotnet\sdk\10.0.100-preview.6.25358.103\Sdks\Microsoft.NET.Sdk\targets\Microsoft.NET.RuntimeIdentifierInference.targets(335,5): message NETSDK1057: You are using a preview version of .NET. See: https://aka.ms/dotnet-support-policy [E:\GIT\forkmessager\apps\server-net\tests\Knot.Modules.Chats.UnitTests\Knot.Modules.Chats.UnitTests.csproj]
C:\Program Files\dotnet\sdk\10.0.100-preview.6.25358.103\Sdks\Microsoft.NET.Sdk\targets\Microsoft.NET.RuntimeIdentifierInference.targets(335,5): message NETSDK1057: You are using a preview version of .NET. See: https://aka.ms/dotnet-support-policy [E:\GIT\forkmessager\apps\server-net\tests\Knot.Modules.Identity.UnitTests\Knot.Modules.Identity.UnitTests.csproj]
C:\Program Files\dotnet\sdk\10.0.100-preview.6.25358.103\Sdks\Microsoft.NET.Sdk\targets\Microsoft.NET.RuntimeIdentifierInference.targets(335,5): message NETSDK1057: You are using a preview version of .NET. See: https://aka.ms/dotnet-support-policy [E:\GIT\forkmessager\apps\server-net\src\Modules\Identity\Knot.Modules.Identity.csproj]
C:\Program Files\dotnet\sdk\10.0.100-preview.6.25358.103\Sdks\Microsoft.NET.Sdk\targets\Microsoft.NET.RuntimeIdentifierInference.targets(335,5): message NETSDK1057: You are using a preview version of .NET. See: https://aka.ms/dotnet-support-policy [E:\GIT\forkmessager\apps\server-net\src\Shared\Knot.Shared.Kernel\Knot.Shared.Kernel.csproj]
  Knot.Shared.Kernel -> E:\GIT\forkmessager\apps\server-net\src\Shared\Knot.Shared.Kernel\bin\Debug\net10.0\Knot.Shared.Kernel.dll
  Knot.Modules.Identity -> E:\GIT\forkmessager\apps\server-net\src\Modules\Identity\bin\Debug\net10.0\Knot.Modules.Identity.dll
  Knot.Shared.Infrastructure -> E:\GIT\forkmessager\apps\server-net\src\Shared\Knot.Shared.Infrastructure\bin\Debug\net10.0\Knot.Shared.Infrastructure.dll
  Knot.Modules.Identity.UnitTests -> E:\GIT\forkmessager\apps\server-net\tests\Knot.Modules.Identity.UnitTests\bin\Debug\net10.0\Knot.Modules.Identity.UnitTests.dll
E:\GIT\forkmessager\apps\server-net\src\Modules\Chats\Infrastructure\Persistence\ChatsDbContext.cs(16,34): error CS0234: The type or namespace name 'Infrastructure' does not exist in the namespace 'Knot.Shared' (are you missing an assembly reference?) [E:\GIT\forkmessager\apps\server-net\src\Modules\Chats\Knot.Modules.Chats.csproj]
E:\GIT\forkmessager\apps\server-net\src\Modules\Chats\Infrastructure\Persistence\ChatsDbContext.cs(18,101): error CS0234: The type or namespace name 'Infrastructure' does not exist in the namespace 'Knot.Shared' (are you missing an assembly reference?) [E:\GIT\forkmessager\apps\server-net\src\Modules\Chats\Knot.Modules.Chats.csproj]

Build FAILED.

E:\GIT\forkmessager\apps\server-net\src\Modules\Chats\Infrastructure\Persistence\ChatsDbContext.cs(16,34): error CS0234: The type or namespace name 'Infrastructure' does not exist in the namespace 'Knot.Shared' (are you missing an assembly reference?) [E:\GIT\forkmessager\apps\server-net\src\Modules\Chats\Knot.Modules.Chats.csproj]
E:\GIT\forkmessager\apps\server-net\src\Modules\Chats\Infrastructure\Persistence\ChatsDbContext.cs(18,101): error CS0234: The type or namespace name 'Infrastructure' does not exist in the namespace 'Knot.Shared' (are you missing an assembly reference?) [E:\GIT\forkmessager\apps\server-net\src\Modules\Chats\Knot.Modules.Chats.csproj]
    0 Warning(s)
    2 Error(s)

Time Elapsed 00:00:00.89
